BDBM434069 US10562890, Compound Al-10-47
SMILES FC(F)(F)Oc1ccc2[nH]c(nc2c1)-c1ccccn1
InChI Key InChIKey=JSNWHSDKJSOXET-UHFFFAOYSA-N
Data  1 IC50
  Tab Delimited (TSV)   2D SDfile   Computed 3D by Vconf -m prep SDfile
Find this compound or compounds like it in BindingDB:
Activity Spreadsheet -- Enzyme Inhibition Constant Data from BindingDB
Found 1 hit for monomerid = 434069
TargetRunt-related transcription factor 1(Homo sapiens (Human))
University of Virginia Patent Foundation
US Patent
LigandPNGBDBM434069(US10562890, Compound Al-10-47)
Affinity DataIC50:  3.19E+3nM. Assay description: FRET assay can be used to effectively monitor the inhibition of CBF binding to the Runt domain of RUNX proteins (as well as for CBFβ-SMMHC bindi...
In DepthDetails US Patent